{"text_format":"1","workbook":"xlsx","n_sheets":4,"sheets":["Course Competency Tool","INPUT TAB","Competency Alignment","Competency Definitions"],"not_rendered":{"charts":0,"images":2,"macros":1,"external_links":0,"defined_names":9,"comments":1,"pivot_tables":0},"unopened":[],"bounds":{"document_bytes":16777216,"sheet_cells":100000,"rows_first":2000,"rows_last":500,"rows_between":2000,"halvings":0,"cell_chars":16384,"cell_head_chars":4096},"cells_cut":0,"cells_raw":0,"read":"whole","date_system":"1900"}

{"sheet":"Course Competency Tool","index":0,"n_rows":62,"n_cols":34,"rows_kept":62,"cut":false,"hidden":false,"merged":[[61,12,61,13],[52,12,52,13],[53,12,53,13],[54,12,54,13],[55,12,55,13],[56,12,56,13],[58,12,58,13],[59,12,59,13],[57,12,57,13],[30,12,30,13],[32,12,32,13],[33,12,33,13],[34,12,34,13],[35,12,35,13],[49,12,49,13],[50,12,50,13],[51,12,51,13],[60,12,60,13],[47,12,47,13],[48,12,48,13],[37,12,37,13],[38,12,38,13],[39,12,39,13],[40,12,40,13],[41,12,41,13],[42,12,42,13],[43,12,43,13],[44,12,44,13],[45,12,45,13],[46,12,46,13],[1,8,1,19],[3,8,4,8],[3,15,3,19],[6,14,6,19],[7,14,7,19],[9,14,9,19],[10,14,10,19],[6,8,6,12],[7,8,7,12],[9,8,9,12],[10,8,10,12],[3,9,4,12],[3,13,4,14],[14,8,14,19],[19,14,19,19],[18,12,18,19],[61,14,61,19],[60,14,60,19],[59,14,59,19],[58,14,58,19],[57,14,57,19],[56,14,56,19],[55,14,55,19],[54,14,54,19],[53,14,53,19],[52,14,52,19],[51,14,51,19],[50,14,50,19],[18,8,18,10],[21,8,21,10],[19,12,19,13],[20,9,20,10],[36,12,36,13],[22,12,22,13],[22,8,33,10],[31,12,31,13],[23,12,23,13],[44,14,44,19],[43,14,43,19],[42,14,42,19],[41,14,41,19],[40,14,40,19],[49,14,49,19],[48,14,48,19],[47,14,47,19],[46,14,46,19],[45,14,45,19],[34,14,34,19],[33,14,33,19],[32,14,32,19],[31,14,31,19],[30,14,30,19],[39,14,39,19],[38,14,38,19],[37,14,37,19],[36,14,36,19],[35,14,35,19],[24,14,24,19],[23,14,23,19],[22,14,22,19],[21,14,21,19],[20,14,20,19],[19,9,19,10],[20,12,20,13],[21,12,21,13],[29,14,29,19],[28,14,28,19],[27,14,27,19],[26,14,26,19],[25,14,25,19],[24,12,24,13],[25,12,25,13],[26,12,26,13],[27,12,27,13],[28,12,28,13],[29,12,29,13]]}
[]
[null,null,null,null,null,null,null,null,"VAAA CPS COURSE COMPETENCY TOOL\nVersion #5"]
[]
[null,null,null,null,null,null,null,null,"1. Order of Selection: \nFollow STEP #1 through STEP #4, by making your selection from the applicable drop down list. The darkest blue box directs you to the next choice you can make.","2. Effect of Choices: \nThe \"Competency Information\" and \"Courses\" sections will update based on the input provided.",null,null,null,"3. Updating the Tool (Optional):\nAs horizonatal scrolling has been disabled, use the \"Zoom In\" or \"Zoom Out\" buttons, as applicable, to see all aspects of the tool. The tool can be continuously updated with new inputs, as you work through it (resetting is not required). However, if you would like to start a completely new search, click the \"RESET TOOL\" button at the top right side of the tool.\n**PLEASE NOTE: Courses taught virtually are highlighted in green, with bold font.",null,"E-mail Comments/Questions:"]
[]
[]
{"$rows_left_out":57}
{"sheet":"INPUT TAB","index":1,"n_rows":132,"n_cols":18,"rows_kept":132,"cut":false,"hidden":true,"merged":[]}
["Competency Type",null,"Competencies",null,null,null,"Programs",2,null,"Levels",{"$f":"J1","v":"Levels"},null,"Program Options","Level Options","Courses","Helper 1","Helper 2","Helper 3"]
["(Select Competency Type)",null,{"$f":"IF('Course Competency Tool'!$I$8=\"\",$A$2,IF('Course Competency Tool'!$I$8='INPUT TAB'!$A$2,'INPUT TAB'!$A$2,\"(Select Competency)\"))","v":"(Select Competency Type)"},null,null,{"$f":"G2","v":"(Select Competency Type)"},{"$f":"IF('Course Competency Tool'!$I$8=\"\",$A$2,IF('Course Competency Tool'!$O$8=\"\",$C$2,IF(IFERROR(VLOOKUP('Course Competency Tool'!$O$8,'INPUT TAB'!$C:$E,3,FALSE),0)<>2,C2,IF('Course Competency Tool'!$I$8='INPUT TAB'!$A$2,'INPUT TAB'!$A$2,IF('Course Competency Tool'!$O$8='INPUT TAB'!$D$2,'INPUT TAB'!$D$2,\"(Select Program)\")))))","v":"(Select Competency Type)"},null,{"$f":"J2","v":"(Select Competency Type)"},{"$f":"IF('Course Competency Tool'!$I$8=\"\",$A$2,IF('Course Competency Tool'!$O$8=\"\",$C$2,IF('Course Competency Tool'!$I$11=\"\",$G$2,IF('Course Competency Tool'!$I$8='INPUT TAB'!$A$2,'INPUT TAB'!$A$2,IF('Course Competency Tool'!$O$8='INPUT TAB'!$D$2,'INPUT TAB'!$D$2,IF('Course Competency Tool'!$I$11='INPUT TAB'!$G$2,'INPUT TAB'!G2,\"(Select Level)\"))))))","v":"(Select Competency Type)"},{"$f":"IF('Course Competency Tool'!$I$8=\"\",$A$2,IF('Course Competency Tool'!$O$8=\"\",$C$2,IF('Course Competency Tool'!$I$11=\"\",$G$2,IF(IFERROR(VLOOKUP('Course Competency Tool'!$O$8,'INPUT TAB'!$C:$E,3,FALSE),0)<>2,C2,IF(IFERROR(VLOOKUP('Course Competency Tool'!$I$11,'INPUT TAB'!$G:$H,2,FALSE),0)<>2,G2,IF('Course Competency Tool'!$I$8='INPUT TAB'!$A$2,'INPUT TAB'!$A$2,IF('Course Competency Tool'!$O$8='INPUT TAB'!$D$2,'INPUT TAB'!$D$2,IF('Course Competency Tool'!$I$11='INPUT TAB'!$G$2,'INPUT TAB'!G2,\"(Select Level)\"))))))))","v":"(Select Competency Type)"},null,"FAC-C","I",{"$f":"IFERROR(INDEX('Competency Alignment'!E:E,SMALL(IF((IF('Course Competency Tool'!$I$8<>\"\",Competency_Type='Course Competency Tool'!$I$8,TRUE))+(IF('Course Competency Tool'!$O$8<>\"\",Competency='Course Competency Tool'!$O$8,TRUE))+(IF('Course Competency Tool'!$I$11=\"Show All\",1,Program='Course Competency Tool'!$I$11))+(IF('Course Competency Tool'!$O$11=\"Show All\",1,Level='Course Competency Tool'!$O$11))=4,ROW(Level)),ROW(D1))),\"Check inputs for Step #1 through Step #4.\")","v":"Check inputs for Step #1 through Step #4."},{"$f":"COUNTIF($O$2:$O$30,\"<=\"&$O2)","v":29},{"$f":"IF(O2=\"\",1,0)","v":0},{"$f":"IF(O2=\"\",P2,P2+$Q$31)","v":57}]
[{"$f":"IFERROR(INDEX(Competency_Type,MATCH(0,COUNTIF($A$2:$A2,Competency_Type),0)),0)","v":"FAI/DAU Technical Competencies"},{"$f":"IF(A3<>0,2,\"\")","v":2},{"$f":"IFERROR(INDEX(Competency,MATCH(0,IF('Course Competency Tool'!$I$8=Competency_Type,COUNTIF($C$2:$C2,Competency),\"\"),0)),0)","v":0},null,{"$f":"IF(AND(C3<>0,C3<>\"\"),2,\"\")","v":""},null,{"$f":"IF('Course Competency Tool'!$I$8=\"\",0,IF(IFERROR(VLOOKUP('Course Competency Tool'!$O$8,'INPUT TAB'!$C:$E,3,FALSE),0)<>2,0,IF(AND(G2<>\"(Select Program)\",'Course Competency Tool'!I11='INPUT TAB'!G2),0,\"Show All\")))","v":0},{"$f":"IF(AND(G3<>\"\",G3<>0),2,\"\")","v":""},null,{"$f":"IF(OR('Course Competency Tool'!$I$11<>'INPUT TAB'!G2,'Course Competency Tool'!$I$11<>'INPUT TAB'!G2),\"Show All\",0)","v":0},{"$f":"IF('Course Competency Tool'!$I$8=\"\",0,IF(IFERROR(VLOOKUP('Course Competency Tool'!$O$8,'INPUT TAB'!$C:$E,3,FALSE),0)<>2,0,IF(IFERROR(VLOOKUP('Course Competency Tool'!$I$11,'INPUT TAB'!$G:$H,2,FALSE),0)<>2,0,J3)))","v":0},{"$f":"IF(AND(K3<>\"\",K3<>0),2,\"\")","v":""},"Continuous Learning","II",{"$f":"IFERROR(INDEX('Competency Alignment'!E:E,SMALL(IF((IF('Course Competency Tool'!$I$8<>\"\",Competency_Type='Course Competency Tool'!$I$8,TRUE))+(IF('Course Competency Tool'!$O$8<>\"\",Competency='Course Competency Tool'!$O$8,TRUE))+(IF('Course Competency Tool'!$I$11=\"Show All\",1,Program='Course Competency Tool'!$I$11))+(IF('Course Competency Tool'!$O$11=\"Show All\",1,Level='Course Competency Tool'!$O$11))=4,ROW(Level)),ROW('Competency Alignment'!D2))),\"\")","v":""},{"$f":"COUNTIF($O$2:$O$30,\"<=\"&$O3)","v":0},{"$f":"IF(O3=\"\",1,0)","v":1},{"$f":"IF(O3=\"\",P3,P3+$Q$31)","v":0}]
[{"$f":"IFERROR(INDEX(Competency_Type,MATCH(0,COUNTIF($A$2:$A3,Competency_Type),0)),0)","v":"VA 1102 Professional Competencies"},2,{"$f":"IFERROR(INDEX(Competency,MATCH(0,IF('Course Competency Tool'!$I$8=Competency_Type,COUNTIF($C$2:$C3,Competency),\"\"),0)),0)","v":0},null,{"$f":"IF(AND(C4<>0,C4<>\"\"),2,\"\")","v":""},null,{"$f":"IFERROR(INDEX(OFFSET('Competency Alignment'!$C$2,0,0,COUNTA('Competency Alignment'!$C:$C)-1,1),MATCH(0,IF('Course Competency Tool'!$O$8=OFFSET('Competency Alignment'!$B$2,0,0,COUNTA('Competency Alignment'!$B:$B)-1,1),COUNTIF($G$3:$G3,OFFSET('Competency Alignment'!$C$2,0,0,COUNTA('Competency Alignment'!$C:$C)-1,1)),\"\"),0)),0)","v":0},"",null,{"$f":"IFERROR(IF('Course Competency Tool'!$I$11=\"Show All\",INDEX(OFFSET('Competency Alignment'!$A$2,0,0,COUNTA('Competency Alignment'!$C:$C)-1,4),MATCH(1,((OFFSET('Competency Alignment'!$A$2,0,0,COUNTA('Competency Alignment'!$A:$A)-1,1)='Course Competency Tool'!$I$8)*(OFFSET('Competency Alignment'!$B$2,0,0,COUNTA('Competency Alignment'!$A:$A)-1,1)='Course Competency Tool'!$O$8))+IF('Course Competency Tool'!$O$8=Competency,COUNTIF($J$3:$J3,Level)),0),4),INDEX(OFFSET('Competency Alignment'!$A$2,0,0,COUNTA('Competency Alignment'!$A:$A)-1,4),MATCH(1,((OFFSET('Competency Alignment'!$A$2,0,0,COUNTA('Competency Alignment'!$A:$A)-1,1)='Course Competency Tool'!$I$8)*(OFFSET('Competency Alignment'!$B$2,0,0,COUNTA('Competency Alignment'!$B:$B)-1,1)='Course Competency Tool'!$O$8)*(OFFSET('Competency Alignment'!$C$2,0,0,COUNTA('Competency Alignment'!$C:$C)-1,1)='Course Competency Tool'!$I$11))+IF('Course Competency Tool'!$O$8=Competency,COUNTIF($J$3:$J3,Level)),0),4)),0)","v":0},{"$f":"IF(IFERROR(VLOOKUP('Course Competency Tool'!$O$8,'INPUT TAB'!$C:$E,3,FALSE),0)<>2,0,IF(IFERROR(VLOOKUP('Course Competency Tool'!$I$11,'INPUT TAB'!$G:$H,2,FALSE),0)<>2,0,IF(AND(COUNTIF($J$2:$J$10,$N$2)>=1,COUNTIF($K$2:K3,$N$2)=0),$N$2,IF(AND(COUNTIF($J$2:$J$10,$N$3)>=1,COUNTIF($K$2:K3,$N$3)=0),$N$3,IF(AND(COUNTIF($J$2:$J$10,$N$4)>=1,COUNTIF($K$2:K3,$N$4)=0),$N$4,IF(AND(COUNTIF($J$2:$J$10,$N$5)>=1,COUNTIF($K$2:K3,$N$5)=0),$N$5,IF(AND(COUNTIF($J$2:$J$10,$N$6)>=1,COUNTIF($K$2:K3,$N$6)=0),$N$6,IF(AND(COUNTIF($J$2:$J$10,$N$7)>=1,COUNTIF($K$2:K3,$N$7)=0),$N$7,IF(AND(COUNTIF($J$2:$J$10,$N$8)>=1,COUNTIF($K$2:K3,$N$8)=0),$N$8,IF(AND(COUNTIF($J$2:$J$10,$N$9)>=1,COUNTIF($K$2:K3,$N$9)=0),$N$9,IF(AND(COUNTIF($J$2:$J$10,$N$10)>=1,COUNTIF($K$2:K3,$N$10)=0),$N$10,IF(AND(COUNTIF($J$2:$J$10,$N$11)>=1,COUNTIF($K$2:K3,$N$11)=0),$N$11,IF(AND(COUNTIF($J$2:$J$10,$N$12)>=1,COUNTIF($K$2:K3,$N$12)=0),$N$12,IF(AND(COUNTIF($J$2:$J$10,$N$13)>=1,COUNTIF($K$2:K3,$N$13)=0),$N$13,IF(AND(COUNTIF($J$2:$J$10,$N$14)>=1,COUNTIF($K$2:K3,$N$14)=0),$N$14,IF(AND(COUNTIF($J$2:$J$10,$N$15)>=1,COUNTIF($K$2:K3,$N$15)=0),$N$15,IF(AND(COUNTIF($J$2:$J$10,$N$16)>=1,COUNTIF($K$2:K3,$N$16)=0),$N$16,0)))))))))))))))))","v":0},"",null,"III",{"$f":"IFERROR(INDEX('Competency Alignment'!E:E,SMALL(IF((IF('Course Competency Tool'!$I$8<>\"\",Competency_Type='Course Competency Tool'!$I$8,TRUE))+(IF('Course Competency Tool'!$O$8<>\"\",Competency='Course Competency Tool'!$O$8,TRUE))+(IF('Course Competency Tool'!$I$11=\"Show All\",1,Program='Course Competency Tool'!$I$11))+(IF('Course Competency Tool'!$O$11=\"Show All\",1,Level='Course Competency Tool'!$O$11))=4,ROW(Level)),ROW('Competency Alignment'!D3))),\"\")","v":""},{"$f":"COUNTIF($O$2:$O$30,\"<=\"&$O4)","v":0},1,0]
[{"$f":"IFERROR(INDEX(Competency_Type,MATCH(0,COUNTIF($A$2:$A4,Competency_Type),0)),0)","v":0},"",{"$f":"IFERROR(INDEX(Competency,MATCH(0,IF('Course Competency Tool'!$I$8=Competency_Type,COUNTIF($C$2:$C4,Competency),\"\"),0)),0)","v":0},null,"",null,{"$f":"IFERROR(INDEX(OFFSET('Competency Alignment'!$C$2,0,0,COUNTA('Competency Alignment'!$C:$C)-1,1),MATCH(0,IF('Course Competency Tool'!$O$8=OFFSET('Competency Alignment'!$B$2,0,0,COUNTA('Competency Alignment'!$B:$B)-1,1),COUNTIF($G$3:$G4,OFFSET('Competency Alignment'!$C$2,0,0,COUNTA('Competency Alignment'!$C:$C)-1,1)),\"\"),0)),0)","v":0},"",null,{"$f":"IFERROR(IF('Course Competency Tool'!$I$11=\"Show All\",INDEX(OFFSET('Competency Alignment'!$A$2,0,0,COUNTA('Competency Alignment'!$C:$C)-1,4),MATCH(1,((OFFSET('Competency Alignment'!$A$2,0,0,COUNTA('Competency Alignment'!$A:$A)-1,1)='Course Competency Tool'!$I$8)*(OFFSET('Competency Alignment'!$B$2,0,0,COUNTA('Competency Alignment'!$A:$A)-1,1)='Course Competency Tool'!$O$8))+IF('Course Competency Tool'!$O$8=Competency,COUNTIF($J$3:$J4,Level)),0),4),INDEX(OFFSET('Competency Alignment'!$A$2,0,0,COUNTA('Competency Alignment'!$A:$A)-1,4),MATCH(1,((OFFSET('Competency Alignment'!$A$2,0,0,COUNTA('Competency Alignment'!$A:$A)-1,1)='Course Competency Tool'!$I$8)*(OFFSET('Competency Alignment'!$B$2,0,0,COUNTA('Competency Alignment'!$B:$B)-1,1)='Course Competency Tool'!$O$8)*(OFFSET('Competency Alignment'!$C$2,0,0,COUNTA('Competency Alignment'!$C:$C)-1,1)='Course Competency Tool'!$I$11))+IF('Course Competency Tool'!$O$8=Competency,COUNTIF($J$3:$J4,Level)),0),4)),0)","v":0},{"$f":"IF(IFERROR(VLOOKUP('Course Competency Tool'!$O$8,'INPUT TAB'!$C:$E,3,FALSE),0)<>2,0,IF(IFERROR(VLOOKUP('Course Competency Tool'!$I$11,'INPUT TAB'!$G:$H,2,FALSE),0)<>2,0,IF(AND(COUNTIF($J$2:$J$10,$N$2)>=1,COUNTIF($K$2:K4,$N$2)=0),$N$2,IF(AND(COUNTIF($J$2:$J$10,$N$3)>=1,COUNTIF($K$2:K4,$N$3)=0),$N$3,IF(AND(COUNTIF($J$2:$J$10,$N$4)>=1,COUNTIF($K$2:K4,$N$4)=0),$N$4,IF(AND(COUNTIF($J$2:$J$10,$N$5)>=1,COUNTIF($K$2:K4,$N$5)=0),$N$5,IF(AND(COUNTIF($J$2:$J$10,$N$6)>=1,COUNTIF($K$2:K4,$N$6)=0),$N$6,IF(AND(COUNTIF($J$2:$J$10,$N$7)>=1,COUNTIF($K$2:K4,$N$7)=0),$N$7,IF(AND(COUNTIF($J$2:$J$10,$N$8)>=1,COUNTIF($K$2:K4,$N$8)=0),$N$8,IF(AND(COUNTIF($J$2:$J$10,$N$9)>=1,COUNTIF($K$2:K4,$N$9)=0),$N$9,IF(AND(COUNTIF($J$2:$J$10,$N$10)>=1,COUNTIF($K$2:K4,$N$10)=0),$N$10,IF(AND(COUNTIF($J$2:$J$10,$N$11)>=1,COUNTIF($K$2:K4,$N$11)=0),$N$11,IF(AND(COUNTIF($J$2:$J$10,$N$12)>=1,COUNTIF($K$2:K4,$N$12)=0),$N$12,IF(AND(COUNTIF($J$2:$J$10,$N$13)>=1,COUNTIF($K$2:K4,$N$13)=0),$N$13,IF(AND(COUNTIF($J$2:$J$10,$N$14)>=1,COUNTIF($K$2:K4,$N$14)=0),$N$14,IF(AND(COUNTIF($J$2:$J$10,$N$15)>=1,COUNTIF($K$2:K4,$N$15)=0),$N$15,IF(AND(COUNTIF($J$2:$J$10,$N$16)>=1,COUNTIF($K$2:K4,$N$16)=0),$N$16,0)))))))))))))))))","v":0},"",null,"III Elective",{"$f":"IFERROR(INDEX('Competency Alignment'!E:E,SMALL(IF((IF('Course Competency Tool'!$I$8<>\"\",Competency_Type='Course Competency Tool'!$I$8,TRUE))+(IF('Course Competency Tool'!$O$8<>\"\",Competency='Course Competency Tool'!$O$8,TRUE))+(IF('Course Competency Tool'!$I$11=\"Show All\",1,Program='Course Competency Tool'!$I$11))+(IF('Course Competency Tool'!$O$11=\"Show All\",1,Level='Course Competency Tool'!$O$11))=4,ROW(Level)),ROW('Competency Alignment'!D4))),\"\")","v":""},0,1,0]
[{"$f":"IFERROR(INDEX(Competency_Type,MATCH(0,COUNTIF($A$2:$A5,Competency_Type),0)),0)","v":0},"",{"$f":"IFERROR(INDEX(Competency,MATCH(0,IF('Course Competency Tool'!$I$8=Competency_Type,COUNTIF($C$2:$C5,Competency),\"\"),0)),0)","v":0},null,"",null,{"$f":"IFERROR(INDEX(OFFSET('Competency Alignment'!$C$2,0,0,COUNTA('Competency Alignment'!$C:$C)-1,1),MATCH(0,IF('Course Competency Tool'!$O$8=OFFSET('Competency Alignment'!$B$2,0,0,COUNTA('Competency Alignment'!$B:$B)-1,1),COUNTIF($G$3:$G5,OFFSET('Competency Alignment'!$C$2,0,0,COUNTA('Competency Alignment'!$C:$C)-1,1)),\"\"),0)),0)","v":0},"",null,{"$f":"IFERROR(IF('Course Competency Tool'!$I$11=\"Show All\",INDEX(OFFSET('Competency Alignment'!$A$2,0,0,COUNTA('Competency Alignment'!$C:$C)-1,4),MATCH(1,((OFFSET('Competency Alignment'!$A$2,0,0,COUNTA('Competency Alignment'!$A:$A)-1,1)='Course Competency Tool'!$I$8)*(OFFSET('Competency Alignment'!$B$2,0,0,COUNTA('Competency Alignment'!$A:$A)-1,1)='Course Competency Tool'!$O$8))+IF('Course Competency Tool'!$O$8=Competency,COUNTIF($J$3:$J5,Level)),0),4),INDEX(OFFSET('Competency Alignment'!$A$2,0,0,COUNTA('Competency Alignment'!$A:$A)-1,4),MATCH(1,((OFFSET('Competency Alignment'!$A$2,0,0,COUNTA('Competency Alignment'!$A:$A)-1,1)='Course Competency Tool'!$I$8)*(OFFSET('Competency Alignment'!$B$2,0,0,COUNTA('Competency Alignment'!$B:$B)-1,1)='Course Competency Tool'!$O$8)*(OFFSET('Competency Alignment'!$C$2,0,0,COUNTA('Competency Alignment'!$C:$C)-1,1)='Course Competency Tool'!$I$11))+IF('Course Competency Tool'!$O$8=Competency,COUNTIF($J$3:$J5,Level)),0),4)),0)","v":0},{"$f":"IF(IFERROR(VLOOKUP('Course Competency Tool'!$O$8,'INPUT TAB'!$C:$E,3,FALSE),0)<>2,0,IF(IFERROR(VLOOKUP('Course Competency Tool'!$I$11,'INPUT TAB'!$G:$H,2,FALSE),0)<>2,0,IF(AND(COUNTIF($J$2:$J$10,$N$2)>=1,COUNTIF($K$2:K5,$N$2)=0),$N$2,IF(AND(COUNTIF($J$2:$J$10,$N$3)>=1,COUNTIF($K$2:K5,$N$3)=0),$N$3,IF(AND(COUNTIF($J$2:$J$10,$N$4)>=1,COUNTIF($K$2:K5,$N$4)=0),$N$4,IF(AND(COUNTIF($J$2:$J$10,$N$5)>=1,COUNTIF($K$2:K5,$N$5)=0),$N$5,IF(AND(COUNTIF($J$2:$J$10,$N$6)>=1,COUNTIF($K$2:K5,$N$6)=0),$N$6,IF(AND(COUNTIF($J$2:$J$10,$N$7)>=1,COUNTIF($K$2:K5,$N$7)=0),$N$7,IF(AND(COUNTIF($J$2:$J$10,$N$8)>=1,COUNTIF($K$2:K5,$N$8)=0),$N$8,IF(AND(COUNTIF($J$2:$J$10,$N$9)>=1,COUNTIF($K$2:K5,$N$9)=0),$N$9,IF(AND(COUNTIF($J$2:$J$10,$N$10)>=1,COUNTIF($K$2:K5,$N$10)=0),$N$10,IF(AND(COUNTIF($J$2:$J$10,$N$11)>=1,COUNTIF($K$2:K5,$N$11)=0),$N$11,IF(AND(COUNTIF($J$2:$J$10,$N$12)>=1,COUNTIF($K$2:K5,$N$12)=0),$N$12,IF(AND(COUNTIF($J$2:$J$10,$N$13)>=1,COUNTIF($K$2:K5,$N$13)=0),$N$13,IF(AND(COUNTIF($J$2:$J$10,$N$14)>=1,COUNTIF($K$2:K5,$N$14)=0),$N$14,IF(AND(COUNTIF($J$2:$J$10,$N$15)>=1,COUNTIF($K$2:K5,$N$15)=0),$N$15,IF(AND(COUNTIF($J$2:$J$10,$N$16)>=1,COUNTIF($K$2:K5,$N$16)=0),$N$16,0)))))))))))))))))","v":0},"",null,"Available For All Levels",{"$f":"IFERROR(INDEX('Competency Alignment'!E:E,SMALL(IF((IF('Course Competency Tool'!$I$8<>\"\",Competency_Type='Course Competency Tool'!$I$8,TRUE))+(IF('Course Competency Tool'!$O$8<>\"\",Competency='Course Competency Tool'!$O$8,TRUE))+(IF('Course Competency Tool'!$I$11=\"Show All\",1,Program='Course Competency Tool'!$I$11))+(IF('Course Competency Tool'!$O$11=\"Show All\",1,Level='Course Competency Tool'!$O$11))=4,ROW(Level)),ROW('Competency Alignment'!D5))),\"\")","v":""},0,1,0]
{"$rows_left_out":127}
{"sheet":"Competency Alignment","index":2,"n_rows":453,"n_cols":9,"rows_kept":453,"cut":false,"hidden":true,"merged":[]}
["Competency Type","Competency","Program","Level","Courses","Course CLPs","FY16 Course Names & IDs","FY16 Course CLPs","Delivery Method"]
["FAI/DAU Technical Competencies","Activity Program Coordinator for Purchase Card","FAC-C","I","CON 100 (FED) - Shaping Smart Business Arrangements",16,"CON 100 - Shaping Smart Business Arrangements",16,"Instructor Led"]
["FAI/DAU Technical Competencies","Activity Program Coordinator for Purchase Card","FAC-C","II","CON 216 (FED) - Legal Considerations in Contracting",40,"CON 216 - Legal Considerations in Contracting",40,"Instructor Led"]
["FAI/DAU Technical Competencies","Activity Program Coordinator for Purchase Card","Continuous Learning","Available For All Levels","FQN 423 - Simplified Acquisitions",24,"FQN 113 - Simplified Acquisitions",24,"Instructor Led"]
["FAI/DAU Technical Competencies","Addressing Small Business Concerns","FAC-C","I","CON 121 (FED) - Contract Planning",16,"CON 121 - Contract Planning",16,"Instructor Led"]
["FAI/DAU Technical Competencies","Addressing Small Business Concerns","FAC-C","I","CON 124 (FED) - Contract Execution",16,"CON 124 - Contract Execution",16,"Instructor Led"]
{"$rows_left_out":448}
{"sheet":"Competency Definitions","index":3,"n_rows":58,"n_cols":4,"rows_kept":58,"cut":false,"hidden":true,"merged":[]}
["Competency","Definition","Unit of Competence","FAR Parts"]
["Accountability","Holds self and others accountable for measurable high-quality, timely, and cost-effective results. Determines objectives, sets priorities, and delegates work. Accepts responsibility for mistakes. Complies with established control systems and rules.","Professionalism","No Applicable FAR Parts"]
["Activity Program Coordinator for Purchase Card","Performs oversight and execution for the Purchase Card Program.","Other Competencies","FAR 13"]
["Addressing Small Business Concerns","1) Assist small business concerns in understanding how to do business with the government, identifying contracting opportunities, and responding to small business inquiries regarding payment delays or problems.\n\n2) Serve as a small business specialist and assist the Small Business Administration's assigned representative in conducting annual reviews of small business share, evaluation of contractors' subcontracting performance, and planning to maximize the use of small businesses.\n\n3) As a small business specialist provide recommendations on acquisition documents as to whether a particular acquisition should be set aside for one of the Small Business programs.","Small Business/Socio-Economic Programs","FAR 19"]
["Advanced Cost and/or Price Analysis","1) Evaluate the reasonableness of the contractor's proposed cost/price for use in preparing for complex negotiations.\n\n2) Develop positions on pricing-related contract terms and conditions to aid in developing the Government's position. \n\n3) Support special cost, price, and finance efforts by researching, analyzing and providing recommended positions that are in the best interests of the Government. \n\n4) Evaluate award fee/incentive fee plans and arrangements for adherence to policy and guidance.","Advanced Cost and/or Price Analysis","FAR 15"]
["Approve Payment Requests","Approve contractor request for payments to include final vouchers under cost reimbursement contracts, progress payments, performance-based payments, or commercial financing.","Contract Administration","FAR 32.1 - FAR 32.6, FAR 32.905"]
{"$rows_left_out":52}